tie-v
type: LexicalEntry
canonical form: tie
sense: 01288043-v
part of speech: verb

bind-v
type: LexicalEntry
canonical form: bind
sense: 01288043-v
part of speech: verb

01288043-v
type: LexicalConcept
in scheme: en-word.net
definition: fasten or secure with a rope, string, or cord
example: They tied their victim to the chair
ili: i28095
lexfile: verb.contact
part of speech: verb
hypernym: 01343121-v