grand-a
type: LexicalEntry
canonical form: grand
sense: 01281361-s
part of speech: adjective

01281361-s
type: LexicalConcept
in scheme: en-word.net
definition: the most important and magnificent in adornment
example: grand ballroom
example: grand staircase
ili: i6979
lexfile: adj.all
part of speech: adjective satellite
similar: https://en-word.net/synset/01278672-a