upgrade-n
type: LexicalEntry
canonical form: upgrade
sense: 01270081-n
part of speech: noun

01270081-n
type: LexicalConcept
in scheme: en-word.net
definition: the act of improving something (especially machinery) by raising it to a higher grade (as by adding or replacing components)
example: the power plant received a new upgrade
ili: i42052
lexfile: noun.act
part of speech: noun
hypernym: 00249844-n