stimulation-n
type: LexicalEntry
canonical form: stimulation
sense: 01264467-n
part of speech: noun

01264467-n
type: LexicalConcept
in scheme: en-word.net
definition: the act of arousing an organism to action
ili: i42019
lexfile: noun.act
part of speech: noun
hypernym: 00243675-n