inspiration-n
type: LexicalEntry
canonical form: inspiration
sense: 01264338-n
part of speech: noun

stirring-n
type: LexicalEntry
canonical form: stirring
sense: 01264338-n
part of speech: noun

01264338-n
type: LexicalConcept
in scheme: en-word.net
definition: arousing to a particular emotion or action
ili: i42018
lexfile: noun.act
part of speech: noun
hypernym: 00243675-n