incitation-n
type: LexicalEntry
canonical form: incitation
sense: 01263983-n
part of speech: noun

incitement-n
type: LexicalEntry
canonical form: incitement
sense: 01263983-n
part of speech: noun

01263983-n
type: LexicalConcept
in scheme: en-word.net
definition: an act of urging on or spurring on or rousing to action or instigating
example: the incitement of mutiny
ili: i42016
lexfile: noun.act
part of speech: noun
hypernym: 00243675-n