thrill-n
type: LexicalEntry
canonical form: thrill
sense: 01263786-n
part of speech: noun

01263786-n
type: LexicalConcept
in scheme: en-word.net
definition: something that causes you to experience a sudden intense feeling or sensation
example: the thrills of space travel
ili: i42015
lexfile: noun.act
part of speech: noun
hypernym: 01263360-n