red-hot-a
type: LexicalEntry
canonical form: red-hot
sense: 01260045-s
part of speech: adjective

sizzling-a
type: LexicalEntry
canonical form: sizzling
sense: 01260045-s
part of speech: adjective

01260045-s
type: LexicalConcept
in scheme: en-word.net
definition: characterized by intense emotion or interest or excitement
example: a red-hot speech
example: sizzling political issues
ili: i6877
lexfile: adj.all
part of speech: adjective satellite
similar: https://en-word.net/synset/01259404-a