emission-n
type: LexicalEntry
canonical form: emission
sense: 01255647-n
part of speech: noun

emanation-n
type: LexicalEntry
canonical form: emanation
sense: 01255647-n
part of speech: noun

01255647-n
type: LexicalConcept
in scheme: en-word.net
definition: the act of emitting; causing to flow forth
ili: i41968
lexfile: noun.act
part of speech: noun
hypernym: 00045193-n