smooth-v
type: LexicalEntry
canonical form: smooth
sense: 01255535-v
part of speech: verb

smoothen-v
type: LexicalEntry
canonical form: smoothen
sense: 01255535-v
part of speech: verb

01255535-v
type: LexicalConcept
in scheme: en-word.net
definition: make smooth or smoother, as if by rubbing
example: smooth the surface of the wood
ili: i27907
lexfile: verb.contact
part of speech: verb
entails: 01252288-v
hypernym: 00356912-v