resettlement-n
type: LexicalEntry
canonical form: resettlement
sense: 01255153-n
part of speech: noun

relocation-n
type: LexicalEntry
canonical form: relocation
sense: 01255153-n
part of speech: noun

01255153-n
type: LexicalConcept
in scheme: en-word.net
definition: the transportation of people (as a family or colony) to a new settlement (as after an upheaval of some kind)
ili: i41965
lexfile: noun.act
part of speech: noun
hypernym: 00316812-n