waste-n
type: LexicalEntry
canonical form: waste
sense: 01254711-n
part of speech: noun

permissive waste-n
type: LexicalEntry
canonical form: permissive waste
sense: 01254711-n
part of speech: noun

01254711-n
type: LexicalConcept
in scheme: en-word.net
definition: (law) reduction in the value of an estate caused by act or neglect
ili: i41963
lexfile: noun.act
part of speech: noun
domain topic: 08458195-n
hypernym: 00030657-n