hit-n
type: LexicalEntry
canonical form: hit
sense: 01252922-n
part of speech: noun

01252922-n
type: LexicalConcept
in scheme: en-word.net
definition: a murder carried out by an underworld syndicate
example: it has all the earmarks of a Mafia hit
ili: i41951
lexfile: noun.act
part of speech: noun
hypernym: 00221389-n