plane-v
type: LexicalEntry
canonical form: plane
sense: 01252054-v
part of speech: verb

shave-v
type: LexicalEntry
canonical form: shave
sense: 01252054-v
part of speech: verb

01252054-v
type: LexicalConcept
in scheme: en-word.net
definition: cut or remove with or as if with a plane
example: The machine shaved off fine layers from the piece of wood
ili: i27887
lexfile: verb.contact
part of speech: verb
hypernym: 01555301-v