blistering-a
type: LexicalEntry
canonical form: blistering
sense: 01251098-s
part of speech: adjective

blistery-a
type: LexicalEntry
canonical form: blistery
sense: 01251098-s
part of speech: adjective

01251098-s
type: LexicalConcept
in scheme: en-word.net
definition: hot enough to raise (or as if to raise) blisters
example: blistering sun
ili: i6826
lexfile: adj.all
part of speech: adjective satellite
similar: https://en-word.net/synset/01250274-a