intervention-n
type: LexicalEntry
canonical form: intervention
sense: 01242775-n
part of speech: noun

intercession-n
type: LexicalEntry
canonical form: intercession
sense: 01242775-n
part of speech: noun

01242775-n
type: LexicalConcept
in scheme: en-word.net
definition: the act of intervening (as to mediate a dispute, etc.)
example: it occurs without human intervention
ili: i41891
lexfile: noun.act
part of speech: noun
hypernym: 01241629-n