clap-v
type: LexicalEntry
canonical form: clap
sense: 01240163-v
part of speech: verb

01240163-v
type: LexicalConcept
in scheme: en-word.net
definition: strike with the flat of the hand; usually in a friendly way, as in encouragement or greeting
ili: i27814
lexfile: verb.contact
part of speech: verb
hypernym: 01402698-v