clap-v
type: LexicalEntry
canonical form: clap
sense: 01239962-v
part of speech: verb

01239962-v
type: LexicalConcept
in scheme: en-word.net
definition: strike together so as to produce a sharp percussive noise
example: clap two boards together
ili: i27813
lexfile: verb.contact
part of speech: verb
hypernym: 01407698-v