reciprocation-n
type: LexicalEntry
canonical form: reciprocation
sense: 01238614-n
part of speech: noun

01238614-n
type: LexicalConcept
in scheme: en-word.net
definition: the act of making or doing something in return
ili: i41870
lexfile: noun.act
part of speech: noun
hypernym: 01237294-n