despairing-a
type: LexicalEntry
canonical form: despairing
sense: 01232699-s
part of speech: adjective

desperate-a
type: LexicalEntry
canonical form: desperate
sense: 01232699-s
part of speech: adjective

01232699-s
type: LexicalConcept
in scheme: en-word.net
definition: arising from or marked by despair or loss of hope
example: a despairing view of the world situation
example: the last despairing plea of the condemned criminal
example: a desperate cry for help
example: helpless and desperate — as if at the end of his tether
example: her desperate screams
ili: i6726
lexfile: adj.all
part of speech: adjective satellite
similar: https://en-word.net/synset/01231893-a