abject-a
type: LexicalEntry
canonical form: abject
sense: 01232308-s
part of speech: adjective

unhopeful-a
type: LexicalEntry
canonical form: unhopeful
sense: 01232308-s
part of speech: adjective

01232308-s
type: LexicalConcept
in scheme: en-word.net
definition: showing utter resignation or hopelessness
example: abject surrender
ili: i6724
lexfile: adj.all
part of speech: adjective satellite
similar: https://en-word.net/synset/01231893-a