gesture-n
type: LexicalEntry
canonical form: gesture
sense: 01230869-n
part of speech: noun

01230869-n
type: LexicalConcept
in scheme: en-word.net
definition: something done as an indication of intention
example: a political gesture
example: a gesture of defiance
ili: i41826
lexfile: noun.act
part of speech: noun
hypernym: 06810027-n