manipulate-v
type: LexicalEntry
canonical form: manipulate
sense: 01214263-v
part of speech: verb

01214263-v
type: LexicalConcept
in scheme: en-word.net
definition: hold something in one's hands and move it
ili: i27681
lexfile: verb.contact
part of speech: verb
hypernym: 01213301-v