strike-v
type: LexicalEntry
canonical form: strike
sense: 01212046-v
part of speech: verb

hit-v
type: LexicalEntry
canonical form: hit
sense: 01212046-v
part of speech: verb

01212046-v
type: LexicalConcept
in scheme: en-word.net
definition: produce by manipulating keys or strings of musical instruments
example: The pianist strikes a middle C
example: strike ‘z’ on the keyboard
ili: i27669
lexfile: verb.contact
part of speech: verb
hypernym: 01208838-v