dope-v
type: LexicalEntry
canonical form: dope
sense: 01203444-v
part of speech: verb

01203444-v
type: LexicalConcept
in scheme: en-word.net
definition: take drugs to improve one's athletic performance
ili: i27627
lexfile: verb.consumption
part of speech: verb
hypernym: 01203078-v