smack-v
type: LexicalEntry
canonical form: smack
sense: 01199846-v
part of speech: verb

01199846-v
type: LexicalConcept
in scheme: en-word.net
definition: press (the lips) together and open (the lips) noisily, as in eating
ili: i27606
lexfile: verb.consumption
part of speech: verb
hypernym: 00985856-v