wallow-v
type: LexicalEntry
canonical form: wallow
sense: 01194507-v
part of speech: verb

01194507-v
type: LexicalConcept
in scheme: en-word.net
definition: devote oneself entirely to something; indulge in to an immoderate degree, usually with pleasure
example: Wallow in luxury
example: wallow in your sorrows
ili: i27579
lexfile: verb.consumption
part of speech: verb
hypernym: 02516942-v