opinion-n
type: LexicalEntry
canonical form: opinion
sense: 01193648-n
part of speech: noun

ruling-n
type: LexicalEntry
canonical form: ruling
sense: 01193648-n
part of speech: noun

01193648-n
type: LexicalConcept
in scheme: en-word.net
definition: the reason for a court's judgment (as opposed to the decision itself)
ili: i41631
lexfile: noun.act
part of speech: noun
domain topic: 08458195-n
hypernym: 01190300-n