leaden-a
type: LexicalEntry
canonical form: leaden
sense: 01193396-s
part of speech: adjective

weighted-a
type: LexicalEntry
canonical form: weighted
sense: 01193396-s
part of speech: adjective

01193396-s
type: LexicalConcept
in scheme: en-word.net
definition: made heavy or weighted down with weariness
example: his leaden arms
example: weighted eyelids
ili: i6507
lexfile: adj.all
part of speech: adjective satellite
similar: https://en-word.net/synset/01192305-a