heavy-a
type: LexicalEntry
canonical form: heavy
sense: 01192034-s
part of speech: adjective

01192034-s
type: LexicalConcept
in scheme: en-word.net
definition: large and powerful; especially designed for heavy loads or rough work
example: a heavy truck
example: heavy machinery
ili: i6502
lexfile: adj.all
part of speech: adjective satellite
similar: https://en-word.net/synset/01191871-a