answer-v
type: LexicalEntry
canonical form: answer
sense: 01186429-v
part of speech: verb

01186429-v
type: LexicalConcept
in scheme: en-word.net
definition: be satisfactory for; meet the requirements of or serve the purpose of
example: This may answer her needs
ili: i27535
lexfile: verb.consumption
part of speech: verb
hypernym: 01185870-v