cater-v
type: LexicalEntry
canonical form: cater
sense: 01183141-v
part of speech: verb

01183141-v
type: LexicalConcept
in scheme: en-word.net
definition: supply food ready to eat; for parties and banquets
ili: i27522
lexfile: verb.consumption
part of speech: verb
hypernym: 01185006-v