riposte-n
type: LexicalEntry
canonical form: riposte
sense: 01177315-n
part of speech: noun

01177315-n
type: LexicalConcept
in scheme: en-word.net
definition: (fencing) a counterattack made immediately after successfully parrying the opponents lunge
ili: i41554
lexfile: noun.act
part of speech: noun
domain topic: 01174134-n
hypernym: 00980259-n