guzzle-v
type: LexicalEntry
canonical form: guzzle
sense: 01173104-v
part of speech: verb

01173104-v
type: LexicalConcept
in scheme: en-word.net
definition: drink greedily or as if with great thirst
example: The boys guzzled the cheap vodka
ili: i27469
lexfile: verb.consumption
part of speech: verb
hypernym: 01172332-v