riot-n
type: LexicalEntry
canonical form: riot
sense: 01172992-n
part of speech: noun

public violence-n
type: LexicalEntry
canonical form: public violence
sense: 01172992-n
part of speech: noun

01172992-n
type: LexicalConcept
in scheme: en-word.net
definition: a public act of violence by an unruly mob
ili: i41535
lexfile: noun.act
part of speech: noun
hypernym: 00967515-n