prostration-n
type: LexicalEntry
canonical form: prostration
sense: 01170038-n
part of speech: noun

01170038-n
type: LexicalConcept
in scheme: en-word.net
definition: abject submission; the emotional equivalent of prostrating your body
ili: i41517
lexfile: noun.act
part of speech: noun
hypernym: 01169416-n