addict-v
type: LexicalEntry
canonical form: addict
sense: 01167606-v
part of speech: verb

hook-v
type: LexicalEntry
canonical form: hook
sense: 01167606-v
part of speech: verb

01167606-v
type: LexicalConcept
in scheme: en-word.net
definition: to cause (someone or oneself) to become dependent (on something, especially a narcotic drug)
ili: i27445
lexfile: verb.consumption
part of speech: verb
entails: 01167359-v
hypernym: 00274244-v