repose-v
type: LexicalEntry
canonical form: repose
sense: 01162961-v
part of speech: verb

01162961-v
type: LexicalConcept
in scheme: en-word.net
definition: put or confide something in a person or thing
example: These philosophers reposed the law in the people
ili: i27420
lexfile: verb.consumption
part of speech: verb
hypernym: 01162686-v