constraint-n
type: LexicalEntry
canonical form: constraint
sense: 01152116-n
part of speech: noun

01152116-n
type: LexicalConcept
in scheme: en-word.net
definition: the act of constraining; the threat or use of force to control the thoughts or behavior of others
ili: i41427
lexfile: noun.act
part of speech: noun
hypernym: 01151109-n