classification-n
type: LexicalEntry
canonical form: classification
sense: 01151399-n
part of speech: noun

01151399-n
type: LexicalConcept
in scheme: en-word.net
definition: restriction imposed by the government on documents or weapons that are available only to certain authorized people
ili: i41423
lexfile: noun.act
part of speech: noun
hypernym: 01151109-n