confinement-n
type: LexicalEntry
canonical form: confinement
sense: 01149089-n
part of speech: noun

01149089-n
type: LexicalConcept
in scheme: en-word.net
definition: the act of restraining of a person's liberty by confining them
ili: i41409
lexfile: noun.act
part of speech: noun
hypernym: 01147872-n