turnaround-n
type: LexicalEntry
canonical form: turnaround
sense: 01147068-n
part of speech: noun

turnround-n
type: LexicalEntry
canonical form: turnround
sense: 01147068-n
part of speech: noun

01147068-n
type: LexicalConcept
in scheme: en-word.net
definition: act or process of unloading and loading and servicing a vessel or aircraft for a return trip
ili: i41399
lexfile: noun.act
part of speech: noun
hypernym: 01145325-n