preparation-n
type: LexicalEntry
canonical form: preparation
sense: 01145325-n
part of speech: noun

readying-n
type: LexicalEntry
canonical form: readying
sense: 01145325-n
part of speech: noun

01145325-n
type: LexicalConcept
in scheme: en-word.net
definition: the activity of putting or setting in order in advance of some act or purpose
example: preparations for the ceremony had begun
ili: i41391
lexfile: noun.act
part of speech: noun
hypernym: 00408356-n