toleration-n
type: LexicalEntry
canonical form: toleration
sense: 01144645-n
part of speech: noun

01144645-n
type: LexicalConcept
in scheme: en-word.net
definition: official recognition of the right of individuals to hold dissenting opinions (especially in religion)
ili: i41388
lexfile: noun.act
part of speech: noun
domain topic: 05955536-n
hypernym: 01141515-n