troll-v
type: LexicalEntry
canonical form: troll
sense: 01144189-v
part of speech: verb

01144189-v
type: LexicalConcept
in scheme: en-word.net
definition: angle with a hook and line drawn through the water
ili: i27322
lexfile: verb.competition
part of speech: verb
hypernym: 01144038-v