obedience-n
type: LexicalEntry
canonical form: obedience
sense: 01135185-n
part of speech: noun

respect-n
type: LexicalEntry
canonical form: respect
sense: 01135185-n
part of speech: noun

01135185-n
type: LexicalConcept
in scheme: en-word.net
definition: behavior intended to please your parents
example: their children were never very strong on obedience
example: he went to law school out of respect for his father's wishes
ili: i41341
lexfile: noun.act
part of speech: noun
hypernym: 01133545-n