shield-v
type: LexicalEntry
canonical form: shield
sense: 01132595-v
part of speech: verb

screen-v
type: LexicalEntry
canonical form: screen
sense: 01132595-v
part of speech: verb

01132595-v
type: LexicalConcept
in scheme: en-word.net
definition: protect, hide, or conceal from danger or harm
ili: i27253
lexfile: verb.competition
part of speech: verb
hypernym: 01130619-v