mastery-n
type: LexicalEntry
canonical form: mastery
sense: 01130976-n
part of speech: noun

subordination-n
type: LexicalEntry
canonical form: subordination
sense: 01130976-n
part of speech: noun

01130976-n
type: LexicalConcept
in scheme: en-word.net
definition: the act of mastering or subordinating someone
ili: i41318
lexfile: noun.act
part of speech: noun
hypernym: 01130711-n