defend-v
type: LexicalEntry
canonical form: defend
sense: 01130221-v
part of speech: verb

01130221-v
type: LexicalConcept
in scheme: en-word.net
definition: be on the defensive; act against an attack
ili: i27242
lexfile: verb.competition
part of speech: verb
entails: 01092746-v
hypernym: 02455370-v