strike-v
type: LexicalEntry
canonical form: strike
sense: 01126313-v
part of speech: verb

hit-v
type: LexicalEntry
canonical form: hit
sense: 01126313-v
part of speech: verb

01126313-v
type: LexicalConcept
in scheme: en-word.net
definition: make a strategic, offensive, assault against an enemy, opponent, or a target
example: The Germans struck Poland on Sept. 1, 1939
example: We must strike the enemy's oil fields
example: in the fifth inning, the Giants struck, sending three runners home to win the game 5 to 2
ili: i27219
lexfile: verb.competition
part of speech: verb
hypernym: 01121587-v
similar: 01139564-v
similar: 01211755-v